Ошибка при установке дополнений VirtualBox для Kubuntu

при установке дополнений VirtualBox 4.0.0 для Kubuntu 10.10 возникает ошибка
существо ошибки видно на приложенной картинке - снимке с окна терминала

содержание файла vboxadd-install.log, который упоминается в выводе терминала

make KBUILD_VERBOSE=1 -C /lib/modules/2.6.35-24-generic/build SUBDIRS=/tmp/vbox.0 SRCROOT=/tmp/vbox.0 modules
/usr/src/linux-headers-2.6.35-24-generic/scripts/gcc-version.sh: строка 25: gcc: команда не найдена
/usr/src/linux-headers-2.6.35-24-generic/scripts/gcc-version.sh: строка 26: gcc: команда не найдена
/usr/src/linux-headers-2.6.35-24-generic/arch/x86/Makefile:81: stack protector enabled but no compiler support
make[1]: gcc: Команда не найдена
test -e include/generated/autoconf.h -a -e include/config/auto.conf || ( \
echo; \
echo " ERROR: Kernel configuration is invalid."; \
echo " include/generated/autoconf.h or include/config/auto.conf are missing.";\
echo " Run 'make oldconfig && make prepare' on kernel src to fix it."; \
echo; \
/bin/false)
mkdir -p /tmp/vbox.0/.tmp_versions ; rm -f /tmp/vbox.0/.tmp_versions/*
make -f scripts/Makefile.build obj=/tmp/vbox.0
gcc -Wp,-MD,/tmp/vbox.0/.test.o.d -nostdinc -isystem -I/usr/src/linux-headers-2.6.35-24-generic/arch/x86/include -Iinclude -include include/generated/autoconf.h -Iubuntu/include -D__KERNEL__ -Wall -Wundef -Wstrict-prototypes -Wno-trigraphs -fno-strict-aliasing -fno-common -Werror-implicit-function-declaration -Wno-format-security -fno-delete-null-pointer-checks -O2 -msoft-float -mregparm=3 -freg-struct-return -march=i686 -ffreestanding -pipe -Wno-sign-compare -fno-asynchronous-unwind-tables -fno-omit-frame-pointer -fno-optimize-sibling-calls -pg -I/lib/modules/2.6.35-24-generic/build/include -I/tmp/vbox.0/ -I/tmp/vbox.0/include -I/tmp/vbox.0/r0drv/linux -D__KERNEL__ -DMODULE -DRT_OS_LINUX -DIN_RING0 -D_X86_ -DIN_RT_R0 -DIN_SUP_R0 -DVBGL_VBOXGUEST -DVBGL_HGCM -DVBOX_WITH_HGCM -DMODULE -D"KBUILD_STR(s)=#s" -D"KBUILD_BASENAME=KBUILD_STR(test)" -D"KBUILD_MODNAME=KBUILD_STR(vboxadd_test)" -c -o /tmp/vbox.0/.tmp_test.o /tmp/vbox.0/test.c
/bin/sh: gcc: not found
make[2]: *** [/tmp/vbox.0/test.o] Ошибка 127
make[1]: *** [_module_/tmp/vbox.0] Ошибка 2
make: *** [vboxadd_test] Ошибка 2
Creating user for the Guest Additions.
Creating udev rule for the Guest Additions kernel module

Как исправить ошибку?

ВложениеРазмер
1.jpg45.07 кб
0
dyug - 4 Январь, 2011 - 13:10

Поставить gcc? :-)
ну это, если верить ошибке
/usr/src/linux-headers-2.6.35-24-generic/scripts/gcc-version.sh: строка 25: gcc: команда не найдена
Скорее всего не стоит build-essential, которая за собой и потянет и гцц и маке и все, что необходимо для сборки.
либо - значит ошибка самого скрипта, ищущего тот же гцц не в окружении, а по какому то статическому пути, в котором его нет. :-(

0
vgor - 4 Январь, 2011 - 20:04

да, все правильно
установка build-essential помогла

0
vgor - 4 Январь, 2011 - 20:06

сейчас другая напасть - не могу примонтировать папки хоста

вот вывод терминала, я не понимаю вообще, в чем ошибка

[email protected]:~$ sudo kate /etc/fstab
[sudo] password for vova:
Error: "/var/tmp/kdecache-vova" is owned by uid 1000 instead of uid 0.
Error: "/tmp/kde-vova" is owned by uid 1000 instead of uid 0.
kate(1994)/kdecore (services) KMimeTypeFactory::parseMagic: Now parsing "/usr/share/mime/magic"
Error: "/tmp/ksocket-vova" is owned by uid 1000 instead of uid 0.
QInotifyFileSystemWatcherEngine::addPaths: inotify_add_watch failed: Нет такого файла или каталога
QFileSystemWatcher: failed to add paths: /home/vova/.config/ibus/bus
Bus::open: Can not get ibus-daemon's address.
IBusInputContext::createInputContext: no connection to ibus-daemon

0
Жюстина - 4 Январь, 2011 - 20:27
Изображение пользователя Жюстина.

По секрету скажу, ну никому больше!!! Консолируя: sudo kate /etc/fstab - ничего не примонтируешь!!!

И ошибок ведь нет на самом то деле! У мну если кате запускать на много больше пишет всего такого ошибочного...

sudo nano /etc/fstab - на крайний момент поможет...

0
dyug - 5 Январь, 2011 - 15:22

Гмм? и что? :-)
Где ошибка то?
Разумеется, ошибка винтуалбокса, при монтировании папок, а не при запуске kate :-)
Те ошибки, что я вижу - ошибки взаимодействия кате и кде подсистем и не больше.

Отправить комментарий

CAPTCHA на основе изображений
Введите цифры